Browsing this Thread:
1 Anonymous Users
|
Re: regina and pixman fail to build under ppc-linux (trunk hosted debug=all build)
|
||||
|---|---|---|---|---|
|
Home away from home
![]() |
Try a Build without debug, optimization will through away some unused variable which is confusing as. This might Even be some sort of Bug in the Assembler.
Ciao
Posted on: 2012/2/16 21:25
|
|||
|
||||
|
Re: regina and pixman fail to build under ppc-linux (trunk hosted debug=all build)
|
||||
|---|---|---|---|---|
|
Home away from home
![]() |
With the recent changes, I'm now getting the following assembler error during a fresh hosted-debug build. I'll guess its because I'm actually running ppc-linux on a G5 tower and its 64bit ppc-system or ppc-compiler related, which hasn't been directly supported by AROS...
Compiling compiler/clib/arosc_start.c Compile failed: /home/edb/Src/hosted-debug/bin/linux-ppc/tools/ppc-linux-aros-gcc -iquote /home/edb/Src/hosted-debug/bin/linux-ppc/gen/compiler/clib/shared/ -iquote /home/edb/Src/AROS/compiler/clib -iquote . -Wall -Werror-implicit-function-declaration -DAROS_BUILD_TYPE=AROS_BUILD_TYPE_PERSONAL -O0 -Wno-pointer-sign -g -DADEBUG=1 -DMDEBUG=1 -I/home/edb/Src/AROS/compiler/clib -I/home/edb/Src/AROS/compiler/clib/include -D__mb_cur_max=MB_CUR_MAX -DADATE="16.02.2012" -fno-builtin -D__BSD_VISIBLE=1 -DAROSC_SHARED -I/home/edb/Src/hosted-debug/bin/linux-ppc/gen/compiler/clib/shared/include -include /home/edb/Src/hosted-debug/bin/linux-ppc/gen/compiler/clib/shared/include/arosc_deflibdefs.h -D__AROS__ -c /home/edb/Src/hosted-debug/bin/linux-ppc/gen/compiler/clib/shared/arosc_start.c -o /home/edb/Src/hosted-debug/bin/linux-ppc/gen/compiler/clib/shared/arosc_start.o /tmp/cc1pfZsp.s: Assembler messages: /tmp/cc1pfZsp.s:185: Error: instruction address is not a multiple of 4 /tmp/cc1pfZsp.s:1382: Error: instruction address is not a multiple of 4 /tmp/cc1pfZsp.s:4343: Error: instruction address is not a multiple of 4 make[1]: *** [/home/edb/Src/hosted-debug/bin/linux-ppc/gen/compiler/clib/shared/arosc_start.o] Error 1 make --no-print-directory TOP=/home/edb/Src/hosted-debug SRCDIR=/home/edb/Src/AROS CURDIR=compiler/clib TARGET=linklibs-clib-shared --file=mmakefile linklibs-clib-shared failed: 512 Error: Error while running make in compiler/clib: No such file or directory make: *** [all] Error 10 edb@fruit:~/Src/hosted-debug$
Posted on: 2012/2/16 19:32
|
|||
|
||||
|
Re: regina and pixman fail to build under ppc-linux (trunk hosted debug=all build)
|
||||
|---|---|---|---|---|
|
Home away from home
![]() |
Especially for pixman I wonder were these are coming from? Even more, as they do not show up on a ppc darwin hosted compile.
ciao
Posted on: 2012/2/7 8:51
|
|||
|
||||
|
regina and pixman fail to build under ppc-linux (trunk hosted debug=all build)
|
||||
|---|---|---|---|---|
|
Home away from home
![]() |
With all the recent updates I thought I'd try building
linux-ppc hosted again, (ubuntu 10.04lts on a Mac g5 tower), which mostly compiles and runs except for regina and pixman. If I remove regina, pixman, and cairo from "Contrib" the build continues on to a functional hosted AROS. >gcc --version gcc (Ubuntu 4.4.3-4ubuntu5) 4.4.3 Regina's error.... Building AROS/Libs/regina.library ... There are undefined symbols in '/home/edb/Src/hosted-debug/bin/linux-ppc/AROS/Libs/regina.library': U aroscbase /home/edb/Src/hosted-debug/bin/linux-ppc/gen/compiler/clib/shared/arosc_relstubs.c:16 make[1]: *** [/home/edb/Src/hosted-debug/bin/linux-ppc/AROS/Libs/regina.library] Error 1 make --no-print-directory TOP=/home/edb/Src/hosted-debug SRCDIR=/home/edb/Src/AROS-V1 CURDIR=Contrib/regina TARGET=contrib-regina-module --file=mmakefile contrib-regina-module failed: 512 Error: Error while running make in Contrib/regina: No such file or directory make: *** [all] Error 10 Pixman's error.... Making contrib-gfx-libs-pixman in Contrib/pixman/pixman Building AROS/Libs/pixman.library ... There are undefined symbols in '/home/edb/Src/hosted-debug/bin/linux-ppc/AROS/Libs/pixman.library': U __assert_fail U __errno_location U _dl_hwcap U stderr make[1]: *** [/home/edb/Src/hosted-debug/bin/linux-ppc/AROS/Libs/pixman.library] Error 1 make --no-print-directory TOP=/home/edb/Src/hosted-debug SRCDIR=/home/edb/Src/AROS-V1 CURDIR=Contrib/pixman/pixman TARGET=contrib-gfx-libs-pixman --file=mmakefile contrib-gfx-libs-pixman failed: 512 Error: Error while running make in Contrib/pixman/pixman: No such file or directory make: *** [all] Error 10
Posted on: 2012/2/6 22:15
|
|||
|
||||
You can view topic.
You cannot start a new topic.
You cannot reply to posts.
You cannot edit your posts.
You cannot delete your posts.
You cannot add new polls.
You cannot vote in polls.
You cannot attach files to posts.
You cannot post without approval.
You cannot use topic type.
You cannot use HTML syntax.
You cannot use signature.
You cannot create PDF files.
You cannot get print page.




